BDBM500145 US11021457, Compound 157
SMILES Brc1ccccc1C1CC(=O)C(=CNCCN2CCN(CC(=O)Nc3cccc4C(=O)N(C5CCC(=O)NC5=O)C(=O)c34)CC2)C(=O)C1
InChI Key InChIKey=HGGZAOLXAFIDFT-NKFKGCMQSA-N
Data  1 IC50
  Tab Delimited (TSV)   2D SDfile   Computed 3D by Vconf -m prep SDfile
Find this compound or compounds like it in BindingDB:
Activity Spreadsheet -- Enzyme Inhibition Constant Data from BindingDB
Found 1 hit for monomerid = 500145
TargetMicrotubule-associated proteins 1A/1B light chain 3B(Human)
Wigen Biomedicine Technology (Shanghai)
US Patent
LigandPNGBDBM500145(US11021457, Compound 157)
Affinity DataIC50: <3nM. Assay description: By constructing a prokaryotic expression system, the LC3B protein was successfully expressed and purified, and a preliminary screening and verificati...
Ligand InfoPC cidPC sid
In DepthDetails US Patent