BDBM50014525 (S)-2-(4-((2-amino-2-oxoethyl)((2-methyl-4-oxo-3,4-dihydroquinazolin-6-yl)methyl)amino)-2-fluorobenzamido)pentanedioic acid::2-{4-[Carbamoylmethyl-(2-methyl-4-oxo-3,4-dihydro-quinazolin-6-ylmethyl)-amino]-2-fluoro-benzoylamino}-pentanedioic acid::CHEMBL319629
SMILES Cc1nc2ccc(CN(CC(N)=O)c3ccc(C(=O)N[C@@H](CCC(O)=O)C(O)=O)c(F)c3)cc2c(=O)[nH]1
InChI Key InChIKey=UWRYZPNTWHJNBA-IBGZPJMESA-N
Data  2 IC50
  Tab Delimited (TSV)   2D SDfile   Computed 3D by Vconf -m prep SDfile
Find this compound or compounds like it in BindingDB:
Activity Spreadsheet -- Enzyme Inhibition Constant Data from BindingDB
Found 2 hits for monomerid = 50014525
TargetThymidylate synthase(Homo sapiens (Human))
Meerut Institute Of Engineering And Technology
Curated by ChEMBL
LigandPNGBDBM50014525((S)-2-(4-((2-amino-2-oxoethyl)((2-methyl-4-oxo-3,4...)
Affinity DataIC50:  1.35E+3nM. Assay description: Inhibition of thymidylate synthase
In DepthDetails ArticlePubMed
TargetThymidylate synthase(Mus musculus)
Ici Pharmaceuticals Group
Curated by ChEMBL
LigandPNGBDBM50014525((S)-2-(4-((2-amino-2-oxoethyl)((2-methyl-4-oxo-3,4...)
Affinity DataIC50:  1.34E+3nM. Assay description: Inhibition of partially purified thymidylate synthase (TS)
In DepthDetails ArticlePubMed