BDBM50014947 6-[2-(4-Bromo-naphthalen-1-yl)-vinyl]-4-hydroxy-tetrahydro-pyran-2-one::CHEMBL2368309
SMILES O[C@@H]1C[C@H](OC(=O)C1)\C=C\c1ccc(Br)c2ccccc12
InChI Key InChIKey=ZBMMHOBZFMPSQP-MVTQWGDUSA-N
Data  1 IC50
  Tab Delimited (TSV)   2D SDfile   Computed 3D by Vconf -m prep SDfile
Find this compound or compounds like it in BindingDB:
Activity Spreadsheet -- Enzyme Inhibition Constant Data from BindingDB
Found 1 hit for monomerid = 50014947
Target3-hydroxy-3-methylglutaryl-coenzyme A reductase(Rattus norvegicus (rat))
Merck Sharp & Dohme Research Laboratories
Curated by ChEMBL
LigandPNGBDBM50014947(6-[2-(4-Bromo-naphthalen-1-yl)-vinyl]-4-hydroxy-te...)
Affinity DataIC50:  4.00E+3nM. Assay description: Inhibitory activity against HMG-CoA reductase
In DepthDetails ArticlePubMed