BDBM50014951 6-[2-(4-Bromo-naphthalen-1-yl)-ethyl]-4-hydroxy-tetrahydro-pyran-2-one::CHEMBL353120
SMILES O[C@@H]1CC(CCc2ccc(Br)c3ccccc23)OC(=O)C1
InChI Key InChIKey=PUSPAFQBBUKRQF-PZORYLMUSA-N
Data  1 IC50
  Tab Delimited (TSV)   2D SDfile   Computed 3D by Vconf -m prep SDfile
Find this compound or compounds like it in BindingDB:
Activity Spreadsheet -- Enzyme Inhibition Constant Data from BindingDB
Found 1 hit for monomerid = 50014951
Target3-hydroxy-3-methylglutaryl-coenzyme A reductase(Rattus norvegicus (rat))
Merck Sharp & Dohme Research Laboratories
Curated by ChEMBL
LigandPNGBDBM50014951(6-[2-(4-Bromo-naphthalen-1-yl)-ethyl]-4-hydroxy-te...)
Affinity DataIC50:  2.33E+4nM. Assay description: Inhibitory activity against HMG-CoA reductase
In DepthDetails ArticlePubMed