BDBM50014955 4-Hydroxy-6-[2-(2,4,7-trichloro-naphthalen-1-yl)-ethyl]-tetrahydro-pyran-2-one::CHEMBL350272
SMILES O[C@@H]1CC(CCc2c(Cl)cc(Cl)c3ccc(Cl)cc23)OC(=O)C1
InChI Key InChIKey=FBQKLQQRNHLVNX-NFJWQWPMSA-N
Data  1 IC50
  Tab Delimited (TSV)   2D SDfile   Computed 3D by Vconf -m prep SDfile
Find this compound or compounds like it in BindingDB:
Activity Spreadsheet -- Enzyme Inhibition Constant Data from BindingDB
Found 1 hit for monomerid = 50014955
Target3-hydroxy-3-methylglutaryl-coenzyme A reductase(Rattus norvegicus (rat))
Merck Sharp & Dohme Research Laboratories
Curated by ChEMBL
LigandPNGBDBM50014955(4-Hydroxy-6-[2-(2,4,7-trichloro-naphthalen-1-yl)-e...)
Affinity DataIC50:  32nM. Assay description: Inhibitory activity against HMG-CoA reductase
In DepthDetails ArticlePubMed