BDBM50014957 4-Hydroxy-6-[2-(2,4,7-trimethyl-naphthalen-1-yl)-ethyl]-tetrahydro-pyran-2-one::CHEMBL163734
SMILES Cc1ccc2c(C)cc(C)c(CCC3C[C@@H](O)CC(=O)O3)c2c1
InChI Key InChIKey=IPXWDPHSKPNCLL-AAFJCEBUSA-N
Data  1 IC50
  Tab Delimited (TSV)   2D SDfile   Computed 3D by Vconf -m prep SDfile
Find this compound or compounds like it in BindingDB:
Activity Spreadsheet -- Enzyme Inhibition Constant Data from BindingDB
Found 1 hit for monomerid = 50014957
Target3-hydroxy-3-methylglutaryl-coenzyme A reductase(Rattus norvegicus (rat))
Merck Sharp & Dohme Research Laboratories
Curated by ChEMBL
LigandPNGBDBM50014957(4-Hydroxy-6-[2-(2,4,7-trimethyl-naphthalen-1-yl)-e...)
Affinity DataIC50:  360nM. Assay description: Inhibitory activity against HMG-CoA reductase
In DepthDetails ArticlePubMed