BDBM50015224 CHEMBL3262401
SMILES Cl.CN(CCN1CCN(CC1)c1ccccc1)c1cccc(c1)[N+]([O-])=O
InChI Key InChIKey=SVAKGQQKDUUFNU-UHFFFAOYSA-N
Data  1 KI
  Tab Delimited (TSV)   2D SDfile   Computed 3D by Vconf -m prep SDfile
Find this compound or compounds like it in BindingDB:
Activity Spreadsheet -- Enzyme Inhibition Constant Data from BindingDB
Found 1 hit for monomerid = 50015224
Target5-hydroxytryptamine receptor 7(Homo sapiens (Human))
Universit£
Curated by ChEMBL
LigandPNGBDBM50015224(CHEMBL3262401)
Affinity DataKi:  332nM. Assay description: Displacement of [3H]5-HT from human 5-HT7 receptor expressed in HEK293 cells after 30 mins by microbeta counting analysis
In DepthDetails ArticlePubMed