BDBM50015262 CHEMBL3263049
SMILES CC[C@@H](c1ccccc1)n1cc(NC(=O)c2n[nH]c3cc(ccc23)-c2cn[nH]c2)cn1
InChI Key InChIKey=IAHZIPPNSDBRJA-NRFANRHFSA-N
Data  1 KI
  Tab Delimited (TSV)   2D SDfile   Computed 3D by Vconf -m prep SDfile
Find this compound or compounds like it in BindingDB:
Activity Spreadsheet -- Enzyme Inhibition Constant Data from BindingDB
Found 1 hit for monomerid = 50015262
TargetTyrosine-protein kinase ITK/TSK(Homo sapiens (Human))
Genentech
Curated by ChEMBL
LigandPNGBDBM50015262(CHEMBL3263049)
Affinity DataKi:  1nM. Assay description: Inhibition of full-length ITK (unknown origin) using biotin-EQEDEPEGIYGVLF-NH2 as substrate by plate reader analysis
In DepthDetails ArticlePubMed