BDBM50015304 CHEMBL3263119
SMILES Nc1cc(ccc1-c1nc(no1)-c1ccccc1)C(F)(F)F
InChI Key InChIKey=WKURDEKTSXJDRZ-UHFFFAOYSA-N
Data  1 EC50
  Tab Delimited (TSV)   2D SDfile   Computed 3D by Vconf -m prep SDfile
Find this compound or compounds like it in BindingDB:
Activity Spreadsheet -- Enzyme Inhibition Constant Data from BindingDB
Found 1 hit for monomerid = 50015304
TargetAryl hydrocarbon receptor(Mus musculus (Mouse))
University Of Utah
Curated by ChEMBL
LigandPNGBDBM50015304(CHEMBL3263119)
Affinity DataEC50:  3.20E+3nM. Assay description: Agonist activity at AHR in FVB/N mouse primary mammary epithelial cells assessed as blockade of mammary branching morphogenesis after 144 hrs by micr...
In DepthDetails ArticlePubMed