BDBM50015649 3-(4-{2-[(R)-6-Amino-9-((3R,4S,5S)-5-ethylcarbamoyl-3,4-dihydroxy-tetrahydro-furan-2-yl)-9H-purin-2-ylamino]-ethyl}-phenyl)-propionic acid methyl ester::CHEMBL2374468
SMILES CCNC(=O)[C@H]1O[C@H]([C@H](O)[C@@H]1O)n1cnc2c(N)nc(NCCc3ccc(CCC(=O)OC)cc3)nc12
InChI Key InChIKey=SZYWXQAVPFKJRQ-QPXQOZNCSA-N
Data  2 KI
  Tab Delimited (TSV)   2D SDfile   Computed 3D by Vconf -m prep SDfile
Find this compound or compounds like it in BindingDB:
Activity Spreadsheet -- Enzyme Inhibition Constant Data from BindingDB
Found 2 hits for monomerid = 50015649
TargetAdenosine receptor A2a/A2b(Rattus norvegicus)
Ciba-Geigy
Curated by ChEMBL
LigandPNGBDBM50015649(3-(4-{2-[(R)-6-Amino-9-((3R,4S,5S)-5-ethylcarbamoy...)
Affinity DataKi:  9nM. Assay description: Binding to Adenosine A2 receptor was measured in ADA-pretreated rat striatal membranes using [3H]-CGS- 21680
In DepthDetails ArticlePubMed
TargetAdenosine receptor A1(Rattus norvegicus (rat))
Ciba-Geigy
Curated by ChEMBL
LigandPNGBDBM50015649(3-(4-{2-[(R)-6-Amino-9-((3R,4S,5S)-5-ethylcarbamoy...)
Affinity DataKi:  1.26E+3nM. Assay description: Adenosine A1 receptor binding was measured in adenosine deaminase (ADA) pretreated rat cortical membranes using [3H]cyclohexyladenosine in the presen...
In DepthDetails ArticlePubMed