BDBM50016444 CHEMBL3265065
SMILES CCCN(CC[C@@]1(O)C[C@@H](C1)NC(=O)c1ccc2ccccc2c1)[C@H]1C[C@@H]1c1cccc(Cl)c1
InChI Key InChIKey=XXFDUBQKUBCCOE-DIBLIPFTSA-N
Data  3 KI
  Tab Delimited (TSV)   2D SDfile   Computed 3D by Vconf -m prep SDfile
Find this compound or compounds like it in BindingDB:
Activity Spreadsheet -- Enzyme Inhibition Constant Data from BindingDB
Found 3 hits for monomerid = 50016444
TargetD(3) dopamine receptor(Rattus norvegicus (Rat))
University Of Michigan
Curated by ChEMBL
LigandPNGBDBM50016444(CHEMBL3265065)
Affinity DataKi:  28nM. Assay description: Displacement of [3H]R-(+)-7-OHDPAT from dopamine D3 receptor in Sprague-Dawley rat ventral striatum after 90 mins
In DepthDetails ArticlePubMed
TargetD(3) dopamine receptor(Homo sapiens (Human))
University Of Michigan
Curated by ChEMBL
LigandPNGBDBM50016444(CHEMBL3265065)
Affinity DataKi:  38nM. Assay description: Displacement of [3H]N-methylspiperone from human dopamine D3 receptor expressed in HEK293 cells after 1 hr by liquid scintillation counting analysis
In DepthDetails ArticlePubMed
TargetD(2) dopamine receptor(Homo sapiens (Human))
University Of Michigan
Curated by ChEMBL
LigandPNGBDBM50016444(CHEMBL3265065)
Affinity DataKi:  1.22E+3nM. Assay description: Displacement of [3H]N-methylspiperone from human dopamine D2 receptor expressed in HEK293 cells after 1 hr by liquid scintillation counting analysis
In DepthDetails ArticlePubMed