BDBM50016576 CHEMBL35870::[(Naphthalene-2-sulfonyl)-phenyl-amino]-acetic acid
SMILES OC(=O)CN(c1ccccc1)S(=O)(=O)c1ccc2ccccc2c1
InChI Key InChIKey=QZJHJFWVARVANL-UHFFFAOYSA-N
Data  1 IC50
  Tab Delimited (TSV)   2D SDfile   Computed 3D by Vconf -m prep SDfile
Find this compound or compounds like it in BindingDB:
Activity Spreadsheet -- Enzyme Inhibition Constant Data from BindingDB
Found 1 hit for monomerid = 50016576
TargetAldo-keto reductase family 1 member B1(Rattus norvegicus)
Auburn University
Curated by ChEMBL
LigandPNGBDBM50016576(CHEMBL35870 | [(Naphthalene-2-sulfonyl)-phenyl-ami...)
Affinity DataIC50:  4.50E+3nM. Assay description: Inhibitory concentration against aldose reductase obtained from rat lens
In DepthDetails ArticlePubMed