BDBM50017731 4-Amino-7,7-dioxo-4,5,6,7-tetrahydro-7lambda*6*-thieno[2,3-b]thiopyran-2-sulfonic acid amide; hydrochloride::CHEMBL554091
SMILES NC1CCS(=O)(=O)c2sc(cc12)S(N)(=O)=O
InChI Key InChIKey=YWGOWGONTQICFC-UHFFFAOYSA-N
Data  1 KI
  Tab Delimited (TSV)   2D SDfile   Computed 3D by Vconf -m prep SDfile
Find this compound or compounds like it in BindingDB:
Activity Spreadsheet -- Enzyme Inhibition Constant Data from BindingDB
Found 1 hit for monomerid = 50017731
TargetCarbonic anhydrase 2(Homo sapiens (Human))
Merck Sharp And Dohme
Curated by ChEMBL
LigandPNGBDBM50017731(4-Amino-7,7-dioxo-4,5,6,7-tetrahydro-7lambda*6*-th...)
Affinity DataKi:  3.70nM. Assay description: The equilibrium dissociation constant of the inhibitor-enzyme complex of human Carbonic anhydrase II
In DepthDetails ArticlePubMed