BDBM50017929 CHEMBL3289024
SMILES NCCC1CCN(CC1)C(=O)c1cc(Oc2ccc(cc2)C(N)=N)cc(Oc2ccc(cc2)C(N)=N)c1
InChI Key InChIKey=UFWFYDYOFNNXQW-UHFFFAOYSA-N
Data  3 KI
  Tab Delimited (TSV)   2D SDfile   Computed 3D by Vconf -m prep SDfile
Find this compound or compounds like it in BindingDB:
Activity Spreadsheet -- Enzyme Inhibition Constant Data from BindingDB
Found 3 hits for monomerid = 50017929
TargetSuppressor of tumorigenicity 14 protein(Homo sapiens (Human))
Aurigene Discovery Technologies
Curated by ChEMBL
LigandPNGBDBM50017929(CHEMBL3289024)
Affinity DataKi:  94nM. Assay description: Inhibition of recombinant matriptase (unknown origin) using Boc-Gln-Ala-Arg-7-amido-4-methyl coumarin hydrobromide
In DepthDetails ArticlePubMed
TargetCoagulation factor X(Bos taurus)
Aurigene Discovery Technologies
Curated by ChEMBL
LigandPNGBDBM50017929(CHEMBL3289024)
Affinity DataKi:  1.29E+3nM. Assay description: Inhibition of bovine plasma factor 10a using CH3OCO-D-CHA-Gly-Arg-pNA.AcoH substrate
In DepthDetails ArticlePubMed
TargetProthrombin(Homo sapiens (Human))
Aurigene Discovery Technologies
Curated by ChEMBL
LigandPNGBDBM50017929(CHEMBL3289024)
Affinity DataKi:  4.06E+3nM. Assay description: Inhibition of human thrombin using Boc-Gln-Ala-Arg-7-amido-4-methyl coumarin hydrobromide
In DepthDetails ArticlePubMed