BDBM50018688 CHEMBL3291301
SMILES CCCCCCC#Cc1nc(N)c2nc(Br)n(CC#C)c2n1
InChI Key InChIKey=SFZVZANTMXWQKF-UHFFFAOYSA-N
Data  2 KI  1 IC50
  Tab Delimited (TSV)   2D SDfile   Computed 3D by Vconf -m prep SDfile
Find this compound or compounds like it in BindingDB:
Activity Spreadsheet -- Enzyme Inhibition Constant Data from BindingDB
Found 3 hits for monomerid = 50018688
TargetAdenosine receptor A2a(Homo sapiens (Human))
Yamasa
Curated by ChEMBL
LigandPNGBDBM50018688(CHEMBL3291301)
Affinity DataKi:  0.560nM. Assay description: Displacement of [3H]-CGS-21680 from human adenosine A2A receptor expressed in HEK293 cells after 90 mins
In DepthDetails ArticlePubMed
TargetAdenosine receptor A2a(Homo sapiens (Human))
Yamasa
Curated by ChEMBL
LigandPNGBDBM50018688(CHEMBL3291301)
Affinity DataKi:  0.560nM. Assay description: Binding affinity to human adenosine A2A receptor measured by radioligand-based affinity assay
In DepthDetails PubMed
TargetAdenosine receptor A2a(Rattus norvegicus (rat))
Yamasa
Curated by ChEMBL
LigandPNGBDBM50018688(CHEMBL3291301)
Affinity DataIC50:  5.10nM. Assay description: Antagonist activity at adenosine A2A receptor in 5-HT-treated Wistar rat femoral vein assessed as inhibition of 2-octyn-1-yladenosine-induced vasodil...
In DepthDetails ArticlePubMed