BDBM500198 US11021467, Compound 55
SMILES Nc1nc(N)c(C#N)c(N[C@@H](C2CC2)c2nc3cccc(Cl)c3c(=O)n2CCCNC2COC2)n1
InChI Key InChIKey=NBLUFAUIHOHBMV-SFHVURJKSA-N
Data  3 IC50
  Tab Delimited (TSV)   2D SDfile   Computed 3D by Vconf -m prep SDfile
Find this compound or compounds like it in BindingDB:
Activity Spreadsheet -- Enzyme Inhibition Constant Data from BindingDB
Found 3 hits for monomerid = 500198
TargetPhosphatidylinositol 3-kinase regulatory subunit beta(Homo sapiens (Human))
Gilead Sciences
US Patent
LigandPNGBDBM500198(US11021467, Compound 55)
Affinity DataIC50:  4nM. Assay description: Class I PI3K isoforms were expressed and purified as heterodimeric recombinant proteins. All assay reagents and buffers for the TR-FRET assay were pu...
Ligand InfoPC cidPC sid
In DepthDetails US Patent
TargetPhosphatidylinositol 4,5-bisphosphate 3-kinase catalytic subunit gamma isoform(Homo sapiens (Human))
Gilead Sciences
US Patent
LigandPNGBDBM500198(US11021467, Compound 55)
Affinity DataIC50:  280nM. Assay description: Class I PI3K isoforms were expressed and purified as heterodimeric recombinant proteins. All assay reagents and buffers for the TR-FRET assay were pu...
Ligand InfoPC cidPC sid
In DepthDetails US Patent
TargetPhosphatidylinositol 4,5-bisphosphate 3-kinase catalytic subunit delta isoform(Homo sapiens (Human))
Gilead Sciences
US Patent
LigandPNGBDBM500198(US11021467, Compound 55)
Affinity DataIC50:  0.5nM. Assay description: Class I PI3K isoforms were expressed and purified as heterodimeric recombinant proteins. All assay reagents and buffers for the TR-FRET assay were pu...
Ligand InfoPC cidPC sid
In DepthDetails US Patent