BDBM50020062 CHEMBL3287893
SMILES CCC1CN(C(=O)Nc2ccccc2)c2ccc(cc2O1)-c1ccc(OCC2(CCC2)C(O)=O)nc1
InChI Key InChIKey=YARYTHZZFFJHJX-UHFFFAOYSA-N
Data  2 IC50
  Tab Delimited (TSV)   2D SDfile   Computed 3D by Vconf -m prep SDfile
Find this compound or compounds like it in BindingDB:
Activity Spreadsheet -- Enzyme Inhibition Constant Data from BindingDB
Found 2 hits for monomerid = 50020062
TargetDiacylglycerol O-acyltransferase 1(Homo sapiens (Human))
Merck Research Laboratories
Curated by ChEMBL
LigandPNGBDBM50020062(CHEMBL3287893)
Affinity DataIC50:  290nM. Assay description: Inhibition of human DGAT1 expressed in Sf9 insect cells using 1,2-dioleoyl-sn-glycerol and [14C]-palmitoyl-CoA substrate by scintillation counting an...
In DepthDetails ArticlePubMed
TargetDiacylglycerol O-acyltransferase 1(Mus musculus (mouse))
Merck Research Laboratories
Curated by ChEMBL
LigandPNGBDBM50020062(CHEMBL3287893)
Affinity DataIC50:  110nM. Assay description: Inhibition of mouse DGAT1 expressed in Sf9 insect cells using 1,2-dioleoyl-sn-glycerol and [14C]-palmitoyl-CoA substrate by scintillation counting an...
In DepthDetails ArticlePubMed