BDBM50021185 5-Aminomethyl-4,5-dihydro-isoxazol-3-ol::CHEMBL42464
SMILES NC[C@@H]1CC(O)=NO1
InChI Key InChIKey=ZHCZZTNIHDWRNS-VKHMYHEASA-N
Data  2 IC50
  Tab Delimited (TSV)   2D SDfile   Computed 3D by Vconf -m prep SDfile
Find this compound or compounds like it in BindingDB:
Activity Spreadsheet -- Enzyme Inhibition Constant Data from BindingDB
Found 2 hits for monomerid = 50021185
LigandPNGBDBM50021185(5-Aminomethyl-4,5-dihydro-isoxazol-3-ol | CHEMBL42...)
Affinity DataIC50: >5.00E+5nM. Assay description: In vitro inhibition of GABA uptake in rat brain synaptic membranes
In DepthDetails ArticlePubMed
TargetGamma-aminobutyric acid receptor subunit gamma-1(Rattus norvegicus)
TBA
Curated by ChEMBL
LigandPNGBDBM50021185(5-Aminomethyl-4,5-dihydro-isoxazol-3-ol | CHEMBL42...)
Affinity DataIC50:  4nM. Assay description: In vitro inhibition of [3H]-GABA binding to Gamma-aminobutyric-acid receptor of rat brain synaptic membranes
In DepthDetails ArticlePubMed