BDBM50022018 CHEMBL2372761::Pro-His-Pro-Phe-His-Statine-Tyr-Tyr-Ser-Lys-NH2
SMILES CC(C)C[C@H](NC(=O)[C@H](Cc1c[nH]cn1)NC(=O)[C@H](Cc1ccccc1)NC(=O)[C@@H]1CCCN1C(=O)[C@H](Cc1c[nH]cn1)NC(=O)[C@@H]1CCCN1)[C@@H](O)CC(=O)N[C@@H](Cc1ccc(O)cc1)C(=O)N[C@@H](Cc1ccc(O)cc1)C(=O)N[C@@H](CO)C(=O)N[C@@H](CCCCN)C(N)=O
InChI Key InChIKey=AYYIHYOFTVKVRJ-HXZHMABRSA-N
Data  1 IC50
  Tab Delimited (TSV)   2D SDfile   Computed 3D by Vconf -m prep SDfile
Find this compound or compounds like it in BindingDB:
Activity Spreadsheet -- Enzyme Inhibition Constant Data from BindingDB
Found 1 hit for monomerid = 50022018
TargetRenin(Rattus norvegicus)
Massachusetts General Hospital
Curated by ChEMBL
LigandPNGBDBM50022018(CHEMBL2372761 | Pro-His-Pro-Phe-His-Statine-Tyr-Ty...)
Affinity DataIC50:  7.90E+3nM. Assay description: Inhibitory activity against rat plasma renin in vitro.
In DepthDetails ArticlePubMed