BDBM50022183 (5,7-Dihydroxy-2-oxo-2H-chromen-4-yl)-acetic acid::CHEMBL273984
SMILES OC(=O)Cc1cc(=O)oc2cc(O)cc(O)c12
InChI Key InChIKey=WVYIHVIEQRZMLS-UHFFFAOYSA-N
Data  1 IC50
  Tab Delimited (TSV)   2D SDfile   Computed 3D by Vconf -m prep SDfile
Find this compound or compounds like it in BindingDB:
Activity Spreadsheet -- Enzyme Inhibition Constant Data from BindingDB
Found 1 hit for monomerid = 50022183
TargetAldo-keto reductase family 1 member B1(Rattus norvegicus)
TBA
Curated by ChEMBL
LigandPNGBDBM50022183((5,7-Dihydroxy-2-oxo-2H-chromen-4-yl)-acetic acid ...)
Affinity DataIC50:  260nM. Assay description: Compound was tested for inhibitory concentration against rat lens aldose reductase (noncompetitive inhibition type)
In DepthDetails ArticlePubMed