BDBM50022370 CHEMBL3142232::{1-[1-(3-Cyclohexanesulfonyl-1-cyclohexylmethyl-2-hydroxy-propylcarbamoyl)-2-(1H-imidazol-4-yl)-ethylcarbamoyl]-2-phenyl-ethyl}-carbamic acid tert-butyl ester
SMILES CC(C)(C)OC(=O)N[C@@H](Cc1ccccc1)C(=O)N[C@@H](Cc1c[nH]cn1)C(=O)N[C@@H](CC1CCCCC1)[C@@H](O)CS(=O)(=O)C1CCCCC1
InChI Key InChIKey=KEBQWWDVFOBDBL-YQIWKCOVSA-N
Data  1 IC50
  Tab Delimited (TSV)   2D SDfile   Computed 3D by Vconf -m prep SDfile
Find this compound or compounds like it in BindingDB:
Activity Spreadsheet -- Enzyme Inhibition Constant Data from BindingDB
Found 1 hit for monomerid = 50022370
TargetRenin(Homo sapiens (Human))
Abbott Laboratories
Curated by ChEMBL
LigandPNGBDBM50022370(CHEMBL3142232 | {1-[1-(3-Cyclohexanesulfonyl-1-cyc...)
Affinity DataIC50:  2.5nM. Assay description: Evaluated in vitro for inhibitory potency against renin.
In DepthDetails ArticlePubMed