BDBM50022388 2-{4-[(2-Amino-4-hydroxy-pyrido[3,2-d]pyrimidin-6-ylmethyl)-amino]-benzoylamino}-pentanedioic acid::2-{4-[(2-Amino-4-oxo-3,4-dihydro-pyrido[3,2-d]pyrimidin-6-ylmethyl)-amino]-benzoylamino}-pentanedioic acid::CHEMBL36623
SMILES Nc1nc2ccc(CNc3ccc(cc3)C(=O)NC(CCC(O)=O)C(O)=O)nc2c(=O)[nH]1
InChI Key InChIKey=PEIIBFVUZRSFNO-UHFFFAOYSA-N
Data  4 IC50
  Tab Delimited (TSV)   2D SDfile   Computed 3D by Vconf -m prep SDfile
Find this compound or compounds like it in BindingDB:
Activity Spreadsheet -- Enzyme Inhibition Constant Data from BindingDB
Found 4 hits for monomerid = 50022388
TargetThymidylate synthase(Lactobacillus casei)
Sri International
Curated by ChEMBL
LigandPNGBDBM50022388(2-{4-[(2-Amino-4-hydroxy-pyrido[3,2-d]pyrimidin-6-...)
Affinity DataIC50:  1.40E+4nM. Assay description: Inhibitory activity against thymidylate synthase of Lactobacillus casei
In DepthDetails ArticlePubMed
TargetBifunctional purine biosynthesis protein ATIC(Homo sapiens (Human))
Sri International
Curated by ChEMBL
LigandPNGBDBM50022388(2-{4-[(2-Amino-4-hydroxy-pyrido[3,2-d]pyrimidin-6-...)
Affinity DataIC50:  6.40E+3nM. Assay description: Inhibitory activity against AICAR formyltransferase of Lactobacillus casei
In DepthDetails ArticlePubMed
TargetDihydrofolate reductase(Lactobacillus casei)
Sri International
Curated by ChEMBL
LigandPNGBDBM50022388(2-{4-[(2-Amino-4-hydroxy-pyrido[3,2-d]pyrimidin-6-...)
Affinity DataIC50:  1.20E+4nM. Assay description: Inhibitory activity against dihydrofolate reductase of Lactobacillus casei
In DepthDetails ArticlePubMed
TargetTrifunctional purine biosynthetic protein adenosine-3(Homo sapiens (Human))
Sri International
Curated by ChEMBL
LigandPNGBDBM50022388(2-{4-[(2-Amino-4-hydroxy-pyrido[3,2-d]pyrimidin-6-...)
Affinity DataIC50: >2.00E+4nM. Assay description: Inhibitory activity against GAR transformylase of Lactobacillus casei
In DepthDetails ArticlePubMed