BDBM50022799 Ala-Met-Val-Gly-Arg-Cys-Tyr-Arg-Pro-Cys-Trp-Glu-Val::CHEMBL438946
SMILES CSCC[C@H](NC(=O)[C@H](C)N)C(=O)N[C@@H](C(C)C)C(=O)NCC(=O)N[C@@H](CCCNC(N)=N)C(=O)N[C@H]1CSSC[C@H](NC(=O)[C@@H]2CCCN2C(=O)[C@@H](CCCNC(N)=N)NC(=O)[C@H](Cc2ccc(O)cc2)NC1=O)C(=O)N[C@H](Cc1c[nH]c2ccccc12)C(=O)N[C@H](CCC(O)=O)C(=O)N[C@H](C(C)C)C(O)=O
InChI Key InChIKey=PIKATPHTFFGTTN-AAYLXXCMSA-N
Data  1 EC50
  Tab Delimited (TSV)   2D SDfile   Computed 3D by Vconf -m prep SDfile
Find this compound or compounds like it in BindingDB:
Activity Spreadsheet -- Enzyme Inhibition Constant Data from BindingDB
Found 1 hit for monomerid = 50022799
TargetNicotinamide N-methyltransferase(Homo sapiens (Human))
Universit£ di Camerino
Curated by ChEMBL
LigandPNGBDBM50022799(CHEMBL5276952)
Affinity DataIC50:  240nM. Assay description: Inhibitory activity against cell free dihydrofolate redutase (DHFR) from Mycobacterium lufu
In DepthDetails ArticlePubMed