BDBM50022876 1N-[1-[2-(1-adamantyl)-1-formyl-(1S)-ethylcarbamoyl]-(1S)-ethyl]-2-aminotertiarybutyloxycarbonyl-3-phenyl-(2S)-propanamide::CHEMBL151701
SMILES C[C@H](NC(=O)[C@H](Cc1ccccc1)NC(=O)OC(C)(C)C)C(=O)N[C@@H](CC12CC3CC(CC(C3)C1)C2)C=O
InChI Key InChIKey=QSQCLUYFNQFQAV-ACRXAMNQSA-N
Data  1 IC50
  Tab Delimited (TSV)   2D SDfile   Computed 3D by Vconf -m prep SDfile
Find this compound or compounds like it in BindingDB:
Activity Spreadsheet -- Enzyme Inhibition Constant Data from BindingDB
Found 1 hit for monomerid = 50022876
TargetRenin(Homo sapiens (Human))
Abbott Laboratories
Curated by ChEMBL
LigandPNGBDBM50022876(1N-[1-[2-(1-adamantyl)-1-formyl-(1S)-ethylcarbamoy...)
Affinity DataIC50:  3.50E+4nMpH: 6.0Assay Description:Inhibition of human renal renin at pH 6
In DepthDetails ArticlePubMed