BDBM50022955 CHEMBL3143460::{1-[1-[1-Cyclohexylmethyl-4-(2-dimethylamino-acetylamino)-2-hydroxy-butylcarbamoyl]-2-(1H-imidazol-4-yl)-ethylcarbamoyl]-2-phenyl-ethyl}-carbamic acid tert-butyl ester
SMILES CN(C)CC(=O)NCC[C@H](O)[C@H](CC1CCCCC1)NC(=O)[C@H](Cc1c[nH]cn1)NC(=O)[C@H](Cc1ccccc1)NC(=O)OC(C)(C)C
InChI Key InChIKey=XJYIIKRQGIKYAZ-ZJKCEDAESA-N
Data  1 IC50
  Tab Delimited (TSV)   2D SDfile   Computed 3D by Vconf -m prep SDfile
Find this compound or compounds like it in BindingDB:
Activity Spreadsheet -- Enzyme Inhibition Constant Data from BindingDB
Found 1 hit for monomerid = 50022955
TargetRenin(Homo sapiens (Human))
TBA
Curated by ChEMBL
LigandPNGBDBM50022955(CHEMBL3143460 | {1-[1-[1-Cyclohexylmethyl-4-(2-dim...)
Affinity DataIC50:  100nM. Assay description: Inhibition of human renin
In DepthDetails ArticlePubMed