BDBM50022974 CHEMBL2371840::Pro-Trp(CHO)-His-4(S)amino-3(s)-hydroxy-5-phenylpentanoic acid-Ile-Trp(CHO)NH2
SMILES CC[C@H](C)[C@H](NC(=O)[C@H](CCCc1ccccc1)NC(=O)[C@H](Cc1c[nH]cn1)NC(=O)[C@H](Cc1cn(C=O)c2ccccc12)NC(=O)[C@@H]1CCCN1)C(=O)N[C@@H](Cc1cn(C=O)c2ccccc12)C(N)=O
InChI Key InChIKey=XSRSCSOMHQMZSM-RCPSFPEASA-N
Data  1 IC50
  Tab Delimited (TSV)   2D SDfile   Computed 3D by Vconf -m prep SDfile
Find this compound or compounds like it in BindingDB:
Activity Spreadsheet -- Enzyme Inhibition Constant Data from BindingDB
Found 1 hit for monomerid = 50022974
TargetRenin(Homo sapiens (Human))
TBA
Curated by ChEMBL
LigandPNGBDBM50022974(CHEMBL2371840 | Pro-Trp(CHO)-His-4(S)amino-3(s)-hy...)
Affinity DataIC50:  240nM. Assay description: Inhibitory activity against human plasma renin
In DepthDetails ArticlePubMed