BDBM50022983 CHEMBL3298290
SMILES FC1(F)CCc2c(C1)[nH]nc2C(=O)Nc1cnn(Cc2ccccc2)c1
InChI Key InChIKey=MEKYNOFETGQGRE-UHFFFAOYSA-N
Data  2 KI
  Tab Delimited (TSV)   2D SDfile   Computed 3D by Vconf -m prep SDfile
Find this compound or compounds like it in BindingDB:
Activity Spreadsheet -- Enzyme Inhibition Constant Data from BindingDB
Found 2 hits for monomerid = 50022983
TargetTyrosine-protein kinase ITK/TSK(Homo sapiens (Human))
Genentech
Curated by ChEMBL
LigandPNGBDBM50022983(CHEMBL3298290)
Affinity DataKi:  180nM. Assay description: Inhibition of GST-tagged full length ITK (unknown origin) using BLK peptide as substrate after 35 mins
In DepthDetails ArticlePubMed
TargetAurora kinase A(Homo sapiens (Human))
Genentech
Curated by ChEMBL
LigandPNGBDBM50022983(CHEMBL3298290)
Affinity DataKi:  950nM. Assay description: Inhibition of human His-tagged full length AURKA using kemptide peptide as substrate after 60 mins
In DepthDetails ArticlePubMed