BDBM50023096 Boc-Phe-His-Sta-Leu-(+)-alpha-phenylthylamide::CHEMBL412656
SMILES CC(C)CC(NC(=O)[C@H](Cc1cnc[nH]1)NC(=O)[C@H](Cc1ccccc1)NC(=O)OC(C)(C)C)C(O)CC(=O)N[C@@H](CC(C)C)C(=O)NC(C)c1ccccc1
InChI Key InChIKey=QMSOVNSNYWLMDM-CBHLHXOBSA-N
Data  3 KI
  Tab Delimited (TSV)   2D SDfile   Computed 3D by Vconf -m prep SDfile
Find this compound or compounds like it in BindingDB:
Activity Spreadsheet -- Enzyme Inhibition Constant Data from BindingDB
Found 3 hits for monomerid = 50023096
TargetRenin(Homo sapiens (Human))
Merck Sharp & Dohme Research Laboratories
Curated by ChEMBL
LigandPNGBDBM50023096(Boc-Phe-His-Sta-Leu-(+)-alpha-phenylthylamide | CH...)
Affinity DataKi:  6nM. Assay description: Inhibition of purified human kidney renin, radioimmunoassay using a synthetic tetradecapeptide renin substrate at 10e-9 M concentration
In DepthDetails ArticlePubMed
TargetRenin(Homo sapiens (Human))
Merck Sharp & Dohme Research Laboratories
Curated by ChEMBL
LigandPNGBDBM50023096(Boc-Phe-His-Sta-Leu-(+)-alpha-phenylthylamide | CH...)
Affinity DataKi:  19nM. Assay description: Inhibition of human plasma renin at 10e-9 M concentration
In DepthDetails ArticlePubMed
TargetRenin(Homo sapiens (Human))
Merck Sharp & Dohme Research Laboratories
Curated by ChEMBL
LigandPNGBDBM50023096(Boc-Phe-His-Sta-Leu-(+)-alpha-phenylthylamide | CH...)
Affinity DataKi:  100nM. Assay description: Inhibition of purified human kidney renin, radioimmunoassay using a synthetic tetradecapeptide renin substrate at 10e-9 M concentration
In DepthDetails ArticlePubMed