BDBM50023097 CHEMBL3298860
SMILES C[C@@H](O)[C@H](NC(=O)[C@@H](CS)Cc1ccccc1)C(O)=O
InChI Key InChIKey=FMCIYEXLRNOOTJ-JLLWLGSASA-N
Data  1 KI
  Tab Delimited (TSV)   2D SDfile   Computed 3D by Vconf -m prep SDfile
Find this compound or compounds like it in BindingDB:
Activity Spreadsheet -- Enzyme Inhibition Constant Data from BindingDB
Found 1 hit for monomerid = 50023097
TargetNeprilysin(Homo sapiens (Human))
Pharmaleads
Curated by ChEMBL
LigandPNGBDBM50023097(CHEMBL3298860)
Affinity DataKi:  2.5nM. Assay description: Inhibition of human recombinant NEP using Suc-Ala-Ala-Phe-AMC as substrate after 30 mins by fluorimetry
In DepthDetails ArticlePubMed