BDBM50024090 CHEMBL3325492
SMILES CC(C)N1CCC(C1)NC(=O)c1ccc(COc2ccc(cc2)C(C)(C)C)cc1
InChI Key InChIKey=JMJDXUSMRWZRCX-UHFFFAOYSA-N
Data  1 IC50
  Tab Delimited (TSV)   2D SDfile   Computed 3D by Vconf -m prep SDfile
Find this compound or compounds like it in BindingDB:
Activity Spreadsheet -- Enzyme Inhibition Constant Data from BindingDB
Found 1 hit for monomerid = 50024090
TargetSodium- and chloride-dependent glycine transporter 2(Homo sapiens (Human))
Toray Industries
Curated by ChEMBL
LigandPNGBDBM50024090(CHEMBL3325492)
Affinity DataIC50:  2.80E+3nM. Assay description: Inhibition of human GlyT2 transfected in HEK293 cells assessed as [3H]glycine uptake after 2 hrs
In DepthDetails ArticlePubMed