BDBM50024121 CHEMBL3325490
SMILES CN1CCC(CC1)N1CCC(C1)NC(=O)c1ccc(COc2ccc(cc2)C(C)(C)C)cc1
InChI Key InChIKey=IXSKUBJSHRYGNK-UHFFFAOYSA-N
Data  1 IC50
  Tab Delimited (TSV)   2D SDfile   Computed 3D by Vconf -m prep SDfile
Find this compound or compounds like it in BindingDB:
Activity Spreadsheet -- Enzyme Inhibition Constant Data from BindingDB
Found 1 hit for monomerid = 50024121
TargetSodium- and chloride-dependent glycine transporter 2(Homo sapiens (Human))
Toray Industries
Curated by ChEMBL
LigandPNGBDBM50024121(CHEMBL3325490)
Affinity DataIC50:  250nM. Assay description: Inhibition of human GlyT2 transfected in HEK293 cells assessed as [3H]glycine uptake after 2 hrs
In DepthDetails ArticlePubMed