BDBM50024485 5-[1,1-Bis-(4-chloro-phenyl)-2-phenyl-ethyl]-pyrimidine::CHEMBL29997
SMILES Clc1ccc(cc1)C(Cc1ccccc1)(c1ccc(Cl)cc1)c1cncnc1
InChI Key InChIKey=BYMAOEWKOLRRJM-UHFFFAOYSA-N
Data  1 EC50
  Tab Delimited (TSV)   2D SDfile   Computed 3D by Vconf -m prep SDfile
Find this compound or compounds like it in BindingDB:
Activity Spreadsheet -- Enzyme Inhibition Constant Data from BindingDB
Found 1 hit for monomerid = 50024485
TargetAromatase(Rattus norvegicus)
TBA
Curated by ChEMBL
LigandPNGBDBM50024485(5-[1,1-Bis-(4-chloro-phenyl)-2-phenyl-ethyl]-pyrim...)
Affinity DataEC50:  1.01E+3nM. Assay description: In vitro inhibition of cytochrome P450 19A1 by rat ovarian microsomes incubated with [3H]androstenedione and NADPH-generating system.
In DepthDetails ArticlePubMed