BDBM50026618 17-Hydroxy-17-(2-iodo-vinyl)-13-methyl-1,2,6,7,8,9,10,11,12,13,14,15,16,17-tetradecahydro-cyclopenta[a]phenanthren-3-one::CHEMBL295827
SMILES CC12CCC3C(CCC4=CC(=O)CCC34)C1CCC2(O)\C=C/I
InChI Key InChIKey=KIUMLVBHJJIUCE-KHPPLWFESA-N
Data  1 KI
  Tab Delimited (TSV)   2D SDfile   Computed 3D by Vconf -m prep SDfile
Find this compound or compounds like it in BindingDB:
Activity Spreadsheet -- Enzyme Inhibition Constant Data from BindingDB
Found 1 hit for monomerid = 50026618
TargetProgesterone receptor(Oryctolagus cuniculus)
TBA
Curated by ChEMBL
LigandPNGBDBM50026618(17-Hydroxy-17-(2-iodo-vinyl)-13-methyl-1,2,6,7,8,9...)
Affinity DataKi:  4.26nM. Assay description: Inhibition of [3H]-R5020 binding to rabbit uterine progesterone receptorChecked by Author
In DepthDetails ArticlePubMed