BDBM50027082 CHEMBL2370761
SMILES [H][C@]12CCCN1C(=O)[C@]1([H])CSSC(C)(C)[C@@H](N)C(=O)N[C@@]([H])([C@H](C)c3c(C)cc(OC)cc3C)C(=O)N[C@@]([H])([C@@H](C)CC)C(=O)N[C@]([H])(CCC(=O)NCCCC[C@@H](NC2=O)C(=O)NCC(N)=O)C(=O)N[C@H](CC(N)=O)C(=O)N1
InChI Key InChIKey=FZQFZSNUZDJUFR-NCZWGJQZSA-N
Data  1 IC50
  Tab Delimited (TSV)   2D SDfile   Computed 3D by Vconf -m prep SDfile
Find this compound or compounds like it in BindingDB:
Activity Spreadsheet -- Enzyme Inhibition Constant Data from BindingDB
Found 1 hit for monomerid = 50027082
TargetOxytocin receptor(Homo sapiens (Human))
University Of Arizona
Curated by ChEMBL
LigandPNGBDBM50027082(CHEMBL2370761)
Affinity DataIC50:  1.90E+4nM. Assay description: Binding affinity towards oxytocin receptor
In DepthDetails ArticlePubMed