BDBM50027150 1-[5-(2-Methyl-benzoylamino)-4-oxo-6-phenyl-hexanoyl]-pyrrolidine-2-carboxylic acid::CHEMBL173376
SMILES Cc1ccccc1C(=O)NC(Cc1ccccc1)C(=O)CCC(=O)N1CCC[C@H]1C(O)=O
InChI Key InChIKey=VAFYRBBLYXKEBH-LBAQZLPGSA-N
Data  1 IC50
  Tab Delimited (TSV)   2D SDfile   Computed 3D by Vconf -m prep SDfile
Find this compound or compounds like it in BindingDB:
Activity Spreadsheet -- Enzyme Inhibition Constant Data from BindingDB
Found 1 hit for monomerid = 50027150
TargetAngiotensin-converting enzyme 2(Homo sapiens (Human))
TBA
Curated by ChEMBL
LigandPNGBDBM50027150(1-[5-(2-Methyl-benzoylamino)-4-oxo-6-phenyl-hexano...)
Affinity DataIC50:  46nM. Assay description: Concentration required to inhibit the activity of Angiotensin I converting enzyme by 50%
In DepthDetails ArticlePubMed