BDBM50027845 CHEMBL3338683
SMILES CCCCCCCCCCCCCCCC(=O)N[C@@H](C(C)C)C(=O)N[C@@H]([C@@H](C)O)C(=O)N[C@@H](CC(C)C)C(=O)N[C@@H](C)C(=O)N[C@@H](CC(C)C)C(=O)N[C@@H](Cc1c[nH]c2ccccc12)C(=O)N[C@@H](C)C(=O)N[C@@H]([C@@H](C)O)C(=O)N[C@@H](Cc1ccc(O)cc1)C(=O)N[C@@H]([C@@H](C)O)C(=O)N[C@@H](Cc1ccc(O)cc1)C(=O)N[C@@H](CCCNC(N)=N)C(N)=O
InChI Key InChIKey=VLRJSIKGDVBONG-WNNRXVIOSA-N
Data  1 EC50
  Tab Delimited (TSV)   2D SDfile   Computed 3D by Vconf -m prep SDfile
Find this compound or compounds like it in BindingDB:
Activity Spreadsheet -- Enzyme Inhibition Constant Data from BindingDB
Found 1 hit for monomerid = 50027845
TargetApelin receptor(Homo sapiens (Human))
Novartis Institutes For Biomedical Research
Curated by ChEMBL
LigandPNGBDBM50027845(CHEMBL3338683)
Affinity DataEC50: >3.00E+4nM. Assay description: Agonist activity at APJ receptor in HEK293 cells assessed as inhibition of forskolin-induced cAMP level incubated for 5 mins prior to forskolin chall...
In DepthDetails ArticlePubMed