BDBM50029 4-[2-[3-[benzyl(ethyl)amino]propylamino]-3,4-diketo-cyclobuten-1-yl]piperazine-1-carboxylic acid ethyl ester::4-[2-[3-[ethyl-(phenylmethyl)amino]propylamino]-3,4-dioxo-1-cyclobutenyl]-1-piperazinecarboxylic acid ethyl ester::MLS000093372::SMR000028990::cid_3236302::ethyl 4-[2-({3-[benzyl(ethyl)amino]propyl}amino)-3,4-dioxocyclobut-1-en-1-yl]piperazine-1-carboxylate::ethyl 4-[2-[3-[benzyl(ethyl)amino]propylamino]-3,4-dioxocyclobuten-1-yl]piperazine-1-carboxylate::ethyl 4-[2-[3-[ethyl-(phenylmethyl)amino]propylamino]-3,4-bis(oxidanylidene)cyclobuten-1-yl]piperazine-1-carboxylate
SMILES CCOC(=O)N1CCN(CC1)c1c(NCCCN(CC)Cc2ccccc2)c(=O)c1=O
InChI Key InChIKey=MYFVWGDYJNFUHQ-UHFFFAOYSA-N
Data  1 IC50
  Tab Delimited (TSV)   2D SDfile   Computed 3D by Vconf -m prep SDfile
Find this compound or compounds like it in BindingDB:
Activity Spreadsheet -- Enzyme Inhibition Constant Data from BindingDB
Found 1 hit for monomerid = 50029
TargetInduced myeloid leukemia cell differentiation protein Mcl-1(Homo sapiens (Human))
Emory University
Curated by PubChem BioAssay
LigandPNGBDBM50029(4-[2-[3-[benzyl(ethyl)amino]propylamino]-3,4-diket...)
Affinity DataIC50:  3.87E+3nM. Assay description: NIH Molecular Libraries Screening Centers Network [MLSCN] Emory Chemical Biology Discovery Center in MLSCN Assay provider: Nikolovska-Coleska, Univer...
In DepthDetails PCBioAssay