BDBM50029044 CHEMBL3343242
SMILES COc1ccc(OC[C@]2(C[C@H]2C(=O)Nc2ccccc2)c2ccccc2)cc1OC
InChI Key InChIKey=ZGTPKHMMHHFISB-SQJMNOBHSA-N
Data  2 KI
  Tab Delimited (TSV)   2D SDfile   Computed 3D by Vconf -m prep SDfile
Find this compound or compounds like it in BindingDB:
Activity Spreadsheet -- Enzyme Inhibition Constant Data from BindingDB
Found 2 hits for monomerid = 50029044
TargetOrexin/Hypocretin receptor type 1(Homo sapiens (Human))
Eisai
Curated by ChEMBL
LigandPNGBDBM50029044(CHEMBL3343242)
Affinity DataKi:  7.20nM. Assay description: Displacement of [125I]-Orexin A from human OX1R expressed in CHO cells after 30 mins by topcount analysis
In DepthDetails ArticlePubMed
TargetOrexin receptor type 2(Homo sapiens (Human))
Eisai
Curated by ChEMBL
LigandPNGBDBM50029044(CHEMBL3343242)
Affinity DataKi:  7.20nM. Assay description: Displacement of [125I]-Orexin A from human OX2R expressed in CHO cells after 30 mins by topcount analysis
In DepthDetails ArticlePubMed