BDBM50029678 4-(3,5-Dimethyl-phenylsulfanyl)-5-ethyl-6-methyl-1H-pyridin-2-one::CHEMBL341931
SMILES CCc1c(C)[nH]c(=O)cc1Sc1cc(C)cc(C)c1
InChI Key InChIKey=RTHOWUMMDRBMHX-UHFFFAOYSA-N
Data  1 IC50
  Tab Delimited (TSV)   2D SDfile   Computed 3D by Vconf -m prep SDfile
Find this compound or compounds like it in BindingDB:
Activity Spreadsheet -- Enzyme Inhibition Constant Data from BindingDB
Found 1 hit for monomerid = 50029678
TargetReverse transcriptase/RNaseH(Human immunodeficiency virus 1)
Institut Curie
Curated by ChEMBL
LigandPNGBDBM50029678(4-(3,5-Dimethyl-phenylsulfanyl)-5-ethyl-6-methyl-1...)
Affinity DataIC50:  400nM. Assay description: Inhibition of HIV-1 reverse transcriptase(RT)
In DepthDetails ArticlePubMed