BDBM50030030 CHEMBL2371540::R(Pen)-G-H-R-G-D-L-R-C-R
SMILES CC(C)C[C@@H]1NC(=O)[C@@H](CC(O)=O)NC(=O)CNC(=O)[C@@H](CCCN=C(N)N)NC(=O)[C@H](Cc2c[nH]cn2)NC(=O)CNC(=O)[C@H](N)CCCN=C(N)NC(=O)[C@H](N)C(C)(C)SSC[C@H](NC(=O)[C@@H](CCCN=C(N)N)NC1=O)C(=O)N[C@@H](CCCN=C(N)N)C(O)=O
InChI Key InChIKey=AICBXHQRXOXRSL-ZOBHNXFDSA-N
Data  2 IC50
  Tab Delimited (TSV)   2D SDfile   Computed 3D by Vconf -m prep SDfile
Find this compound or compounds like it in BindingDB:
Activity Spreadsheet -- Enzyme Inhibition Constant Data from BindingDB
Found 2 hits for monomerid = 50030030
TargetIntegrin alpha-IIb/beta-3(Homo sapiens (Human))
Telios Pharmaceuticals
Curated by ChEMBL
LigandPNGBDBM50030030(CHEMBL2371540 | R(Pen)-G-H-R-G-D-L-R-C-R)
Affinity DataIC50:  40nM. Assay description: Binding affinity against integrin alpha 2b-beta 3 in enzyme linked immunosorbent assay (ELISA)
In DepthDetails ArticlePubMed
TargetIntegrin alpha-V/beta-5(Homo sapiens (Human))
Telios Pharmaceuticals
Curated by ChEMBL
LigandPNGBDBM50030030(CHEMBL2371540 | R(Pen)-G-H-R-G-D-L-R-C-R)
Affinity DataIC50:  40nM. Assay description: Binding affinity against integrin alpha V-beta5 in enzyme linked immunosorbent assay (ELISA)
In DepthDetails ArticlePubMed