BDBM50030414 CHEMBL38192::Isopropyl-((1S,2R)-8-methoxy-1-methyl-1,2,3,4-tetrahydro-naphthalen-2-yl)-propyl-amine
SMILES CCCN(C(C)C)[C@@H]1CCc2cccc(OC)c2[C@@H]1C
InChI Key InChIKey=TUOJMXQKHHHIMU-GDBMZVCRSA-N
Data  1 KI
  Tab Delimited (TSV)   2D SDfile   Computed 3D by Vconf -m prep SDfile
Find this compound or compounds like it in BindingDB:
Activity Spreadsheet -- Enzyme Inhibition Constant Data from BindingDB
Found 1 hit for monomerid = 50030414
Target5-hydroxytryptamine receptor 1A(Rattus norvegicus (rat))
Uppsala University
Curated by ChEMBL
LigandPNGBDBM50030414(CHEMBL38192 | Isopropyl-((1S,2R)-8-methoxy-1-methy...)
Affinity DataKi:  116nM. Assay description: Binding affinity for 5-hydroxytryptamine 1A receptor in rat brain tissue using [3H]-8-OH-DPAT as radioligand
In DepthDetails ArticlePubMed