BDBM50031085 2,3-Dichloro-4-(4-fluoro-phenyl)-5-(4-methanesulfonyl-phenyl)-1-methyl-1H-pyrrole::CHEMBL127494
SMILES Cn1c(Cl)c(Cl)c(c1-c1ccc(cc1)S(C)(=O)=O)-c1ccc(F)cc1
InChI Key InChIKey=AKFSJAIZUSQWTP-UHFFFAOYSA-N
Data  2 IC50
  Tab Delimited (TSV)   2D SDfile   Computed 3D by Vconf -m prep SDfile
Find this compound or compounds like it in BindingDB:
Activity Spreadsheet -- Enzyme Inhibition Constant Data from BindingDB
Found 2 hits for monomerid = 50031085
TargetProstaglandin G/H synthase 2(Homo sapiens (Human))
Dupont Pharmaceuticals
Curated by ChEMBL
LigandPNGBDBM50031085(2,3-Dichloro-4-(4-fluoro-phenyl)-5-(4-methanesulfo...)
Affinity DataIC50:  2.50E+4nM. Assay description: Tested for inhibitory activity against Prostaglandin G/H synthase 2 from human
In DepthDetails ArticlePubMed
TargetProstaglandin G/H synthase 1(Ovis aries (Sheep))
Dupont Pharmaceuticals
Curated by ChEMBL
LigandPNGBDBM50031085(2,3-Dichloro-4-(4-fluoro-phenyl)-5-(4-methanesulfo...)
Affinity DataIC50:  6.50E+5nM. Assay description: Tested for inhibitory activity against Prostaglandin G/H synthase 1 from ovine
In DepthDetails ArticlePubMed