BDBM50031276 2-Hydroxymethyl-5-(7-methylamino-imidazo[4,5-b]pyridin-3-yl)-tetrahydro-furan-3-ol::CHEMBL405920
SMILES CNc1ccnc2n(cnc12)C1CC(O)C(CO)O1
InChI Key InChIKey=XZXFBEVZWYHRTC-UHFFFAOYSA-N
Data  1 KI
  Tab Delimited (TSV)   2D SDfile   Computed 3D by Vconf -m prep SDfile
Find this compound or compounds like it in BindingDB:
Activity Spreadsheet -- Enzyme Inhibition Constant Data from BindingDB
Found 1 hit for monomerid = 50031276
TargetAdenosine deaminase(Bos taurus (bovine))
Universit£
Curated by ChEMBL
LigandPNGBDBM50031276(2-Hydroxymethyl-5-(7-methylamino-imidazo[4,5-b]pyr...)
Affinity DataKi:  250nM. Assay description: Inhibition calf intestine adenosine deaminase
In DepthDetails ArticlePubMed