BDBM50032563 CHEMBL275242::[2-Methyl-1-(2-morpholin-4-yl-ethyl)-1H-indol-3-yl]-p-tolyl-methanone
SMILES Cc1c(C(=O)c2ccc(C)cc2)c2ccccc2n1CCN1CCOCC1
InChI Key InChIKey=IXXJXRFQXXILRP-UHFFFAOYSA-N
Data  2 KI  1 IC50
  Tab Delimited (TSV)   2D SDfile   Computed 3D by Vconf -m prep SDfile
Find this compound or compounds like it in BindingDB:
Activity Spreadsheet -- Enzyme Inhibition Constant Data from BindingDB
Found 3 hits for monomerid = 50032563
TargetCannabinoid receptor 1(Rattus norvegicus (rat))
Sanofi Research Division
Curated by ChEMBL
LigandPNGBDBM50032563(CHEMBL275242 | [2-Methyl-1-(2-morpholin-4-yl-ethyl...)
Affinity DataKi:  7.08E+5nM. Assay description: Cannabinoid receptor 1 binding affinity by measuring its ability to displace [3H]WIN-55212-2 in rat forebrain membranes
In DepthDetails ArticlePubMed
TargetCannabinoid receptor 1(Rattus norvegicus (rat))
Sanofi Research Division
Curated by ChEMBL
LigandPNGBDBM50032563(CHEMBL275242 | [2-Methyl-1-(2-morpholin-4-yl-ethyl...)
Affinity DataKi:  7.08E+5nM. Assay description: Binding affinity at cannabinoid receptor 1 using rat brain membranes
In DepthDetails ArticlePubMed
TargetCannabinoid receptor 1(Rattus norvegicus (rat))
Sanofi Research Division
Curated by ChEMBL
LigandPNGBDBM50032563(CHEMBL275242 | [2-Methyl-1-(2-morpholin-4-yl-ethyl...)
Affinity DataIC50:  1.77E+3nM. Assay description: Concentration of compound required to inhibit 50% of [3H]-WIN- 55212 binding to Cannabinoid receptor 1 in rat cerebellum membranes.
In DepthDetails ArticlePubMed