BDBM50033556 6-{[(2,5-Dimethoxy-phenyl)-ethyl-amino]-methyl}-5,6,7,8-tetrahydro-quinazoline-2,4-diamine::CHEMBL121683
SMILES CCN(CC1CCc2nc(N)nc(N)c2C1)c1cc(OC)ccc1OC
InChI Key InChIKey=VAGYLFHVULQBKC-UHFFFAOYSA-N
Data  6 IC50
  Tab Delimited (TSV)   2D SDfile   Computed 3D by Vconf -m prep SDfile
Find this compound or compounds like it in BindingDB:
Activity Spreadsheet -- Enzyme Inhibition Constant Data from BindingDB
Found 6 hits for monomerid = 50033556
TargetDihydrofolate reductase(Rattus norvegicus (rat))
Duquesne University
Curated by ChEMBL
LigandPNGBDBM50033556(6-{[(2,5-Dimethoxy-phenyl)-ethyl-amino]-methyl}-5,...)
Affinity DataIC50:  71nM. Assay description: Inhibitory activity against purified dihydrofolate reductase from rat
In DepthDetails ArticlePubMed
TargetDihydrofolate reductase(Pneumocystis carinii)
Duquesne University
Curated by ChEMBL
LigandPNGBDBM50033556(6-{[(2,5-Dimethoxy-phenyl)-ethyl-amino]-methyl}-5,...)
Affinity DataIC50:  114nM. Assay description: Inhibitory activity against purified dihydrofolate reductase from Pneumocystis carinii.
In DepthDetails ArticlePubMed
TargetBifunctional dihydrofolate reductase-thymidylate synthase(Toxoplasma gondii)
Duquesne University
Curated by ChEMBL
LigandPNGBDBM50033556(6-{[(2,5-Dimethoxy-phenyl)-ethyl-amino]-methyl}-5,...)
Affinity DataIC50:  17nM. Assay description: Inhibition of Toxoplasma gondii dihydrofolate reductase
In DepthDetails ArticlePubMed
TargetDihydrofolate reductase(Rattus norvegicus (rat))
Duquesne University
Curated by ChEMBL
LigandPNGBDBM50033556(6-{[(2,5-Dimethoxy-phenyl)-ethyl-amino]-methyl}-5,...)
Affinity DataIC50:  71nM. Assay description: Inhibition of rat liver dihydrofolate reductase
In DepthDetails ArticlePubMed
TargetDihydrofolate reductase(Pneumocystis carinii)
Duquesne University
Curated by ChEMBL
LigandPNGBDBM50033556(6-{[(2,5-Dimethoxy-phenyl)-ethyl-amino]-methyl}-5,...)
Affinity DataIC50:  114nM. Assay description: Inhibition of Pneumocystis carinii dihydrofolate reductase
In DepthDetails ArticlePubMed
TargetBifunctional dihydrofolate reductase-thymidylate synthase(Toxoplasma gondii)
Duquesne University
Curated by ChEMBL
LigandPNGBDBM50033556(6-{[(2,5-Dimethoxy-phenyl)-ethyl-amino]-methyl}-5,...)
Affinity DataIC50:  17nM. Assay description: Inhibitory activity against purified Dihydrofolate reductase from Toxoplasma gondii.
In DepthDetails ArticlePubMed