BDBM500336 US11021478, Example 32::US11655249, Example 32
SMILES Cc1ccc2C(=O)C(C(=O)NCC(O)=O)=C(O)C3(CCCCC3)n12
InChI Key InChIKey=QWDURJGIXILXST-UHFFFAOYSA-N
Data  2 IC50
  Tab Delimited (TSV)   2D SDfile   Computed 3D by Vconf -m prep SDfile
Find this compound or compounds like it in BindingDB:
Activity Spreadsheet -- Enzyme Inhibition Constant Data from BindingDB
Found 2 hits for monomerid = 500336
TargetEgl nine homolog 1(Homo sapiens (Human))
Kind Pharmaceutical
US Patent
LigandPNGBDBM500336(US11021478, Example 32 | US11655249, Example 32)
Affinity DataIC50:  700nM. Assay description: 1. Effect of Compounds on Activities of HIF Prolyl Hydroxylase-2 Activities of HIF prolyl hydroxylase was determined according to the method as descr...
Ligand InfoPC cidPC sid
In DepthDetails US Patent
TargetEgl nine homolog 1(Homo sapiens (Human))
Kind Pharmaceutical
US Patent
LigandPNGBDBM500336(US11021478, Example 32 | US11655249, Example 32)
Affinity DataIC50:  700nM. Assay description: Activities of HIF prolyl hydroxylase was determined according to the method as described in Anal Biochem, 2004, 330: 74-80, which was slightly modifi...
Ligand InfoPC cidPC sid
In DepthDetails US Patent