BDBM50033660 CHEMBL269745::{[5-(2-Amino-6-oxo-1,6-dihydro-purin-9-yl)-pentyl]-hydroxy-phosphinoylmethyl}-phosphonic acid
SMILES Nc1nc2n(CCCCCP(O)(=O)CP(O)(O)=O)cnc2c(=O)[nH]1
InChI Key InChIKey=IANVADXKYSDKCZ-UHFFFAOYSA-N
Data  2 KI
  Tab Delimited (TSV)   2D SDfile   Computed 3D by Vconf -m prep SDfile
Find this compound or compounds like it in BindingDB:
Activity Spreadsheet -- Enzyme Inhibition Constant Data from BindingDB
Found 2 hits for monomerid = 50033660
TargetPurine nucleoside phosphorylase(Homo sapiens (Human))
Burroughs Wellcome
Curated by ChEMBL
LigandPNGBDBM50033660(CHEMBL269745 | {[5-(2-Amino-6-oxo-1,6-dihydro-puri...)
Affinity DataKi:  3.10nM. Assay description: Inhibition of human erythrocyte purine nucleoside phosphorylase (PNPase) in the presence of zinc chloride
In DepthDetails ArticlePubMed
TargetPurine nucleoside phosphorylase(Homo sapiens (Human))
Burroughs Wellcome
Curated by ChEMBL
LigandPNGBDBM50033660(CHEMBL269745 | {[5-(2-Amino-6-oxo-1,6-dihydro-puri...)
Affinity DataKi:  900nM. Assay description: Inhibition of human erythrocyte purine nucleoside phosphorylase (PNPase) in the presence of ethylenediaminetetraacetic acid (Na2 EDTA)
In DepthDetails ArticlePubMed