BDBM50033746 7-[3-(4-Carbamoyl-3-methoxy-2-propyl-phenoxy)-propoxy]-8-propyl-chroman-2-carboxylic acid::CHEMBL166699::SC-48928
SMILES CCCc1c(OCCCOc2ccc3CCC(Oc3c2CCC)C(O)=O)ccc(C(N)=O)c1OC
InChI Key InChIKey=LGHMHOHMGCTKDT-UHFFFAOYSA-N
Data  2 IC50
  Tab Delimited (TSV)   2D SDfile   Computed 3D by Vconf -m prep SDfile
Find this compound or compounds like it in BindingDB:
Activity Spreadsheet -- Enzyme Inhibition Constant Data from BindingDB
Found 2 hits for monomerid = 50033746
TargetLeukotriene B4 receptor 1(Homo sapiens (Human))
TBA
Curated by ChEMBL
LigandPNGBDBM50033746(7-[3-(4-Carbamoyl-3-methoxy-2-propyl-phenoxy)-prop...)
Affinity DataIC50:  2.40nM. Assay description: Inhibitory activity against leukotriene B4 receptor
In DepthDetails Article
TargetLeukotriene B4 receptor 1(Homo sapiens (Human))
TBA
Curated by ChEMBL
LigandPNGBDBM50033746(7-[3-(4-Carbamoyl-3-methoxy-2-propyl-phenoxy)-prop...)
Affinity DataIC50:  140nM. Assay description: Binding affinity for Leukotriene B4 (LTB4) receptor
In DepthDetails ArticlePubMed