BDBM50034302 CHEMBL23877::Octahydro-pentalene-2-carboxylic acid {4-[4-(2-methoxy-phenyl)-piperazin-1-yl]-butyl}-amide
SMILES COc1ccccc1N1CCN(CCCCNC(=O)C2CC3CCCC3C2)CC1
InChI Key InChIKey=PYPMVMZOGNRNTC-UHFFFAOYSA-N
Data  1 KI
  Tab Delimited (TSV)   2D SDfile   Computed 3D by Vconf -m prep SDfile
Find this compound or compounds like it in BindingDB:
Activity Spreadsheet -- Enzyme Inhibition Constant Data from BindingDB
Found 1 hit for monomerid = 50034302
Target5-hydroxytryptamine receptor 1A(Rattus norvegicus (rat))
Faes
Curated by ChEMBL
LigandPNGBDBM50034302(CHEMBL23877 | Octahydro-pentalene-2-carboxylic aci...)
Affinity DataKi:  0.630nM. Assay description: In vitro ability to displace [3H]-8-OH-DPAT from 5-hydroxytryptamine 1A receptor sites of rat brain cortex.
In DepthDetails ArticlePubMed