BDBM50034304 5-Methyl-thiophene-2-carboxylic acid {2-[4-(2-methoxy-phenyl)-piperazin-1-yl]-ethyl}-amide::CHEMBL22601
SMILES COc1ccccc1N1CCN(CCNC(=O)c2ccc(C)s2)CC1
InChI Key InChIKey=TVCKSRUQZAILGQ-UHFFFAOYSA-N
Data  1 KI
  Tab Delimited (TSV)   2D SDfile   Computed 3D by Vconf -m prep SDfile
Find this compound or compounds like it in BindingDB:
Activity Spreadsheet -- Enzyme Inhibition Constant Data from BindingDB
Found 1 hit for monomerid = 50034304
Target5-hydroxytryptamine receptor 1A(Rattus norvegicus (rat))
Faes
Curated by ChEMBL
LigandPNGBDBM50034304(5-Methyl-thiophene-2-carboxylic acid {2-[4-(2-meth...)
Affinity DataKi:  2.29nM. Assay description: In vitro ability to displace [3H]-8-OH-DPAT from 5-hydroxytryptamine 1A receptor sites of rat brain cortex.
In DepthDetails ArticlePubMed